Target
Mucosa-associated lymphoid tissue lymphoma translocation protein 1
Ligand
BDBM355923
Substrate
Meas. Tech.
Biochemical Assay
IC50
0.029±n/a nM
Citation
 Soldermann, CPQuancard, JSchlapbach, ASimic, OTintelnot-Blomley, MZoller, T Pyrazolo pyrimidine derivatives and their use as MALT1 inhibitors US Patent  US9815842 Publication Date 11/14/2017 
Target
Name:
Mucosa-associated lymphoid tissue lymphoma translocation protein 1
Synonyms:
MALT lymphoma-associated translocation MALT1 MLT Paracaspase
Type:
Enzyme
Mol. Mass.:
92257.81
Organism:
Homo sapiens (Human)
Description:
Q9UDY8
Residue:
824
  
Inhibitor
Name:
BDBM355923
Synonyms:
(R)-1-(2-chloro-7-(1- methoxyethyl)pyrazo- lo[1,5-a]pyrimidin-6- yl)-3-(2- (trifluoromethyl)pyri- din-4-yl)urea US9815842, Example 47
Type:
Small organic molecule
Emp. Form.:
C16H14ClF3N6O2
Mol. Mass.:
414.77
SMILES:
CO[C@H](C)c1c(NC(=O)Nc2ccnc(c2)C(F)(F)F)cnc2cc(Cl)nn12
: