Target
Mucosa-associated lymphoid tissue lymphoma translocation protein 1
Ligand
BDBM355944
Substrate
Meas. Tech.
Biochemical Assay
IC50
0.039±n/a nM
Citation
 Soldermann, CPQuancard, JSchlapbach, ASimic, OTintelnot-Blomley, MZoller, T Pyrazolo pyrimidine derivatives and their use as MALT1 inhibitors US Patent  US9815842 Publication Date 11/14/2017 
Target
Name:
Mucosa-associated lymphoid tissue lymphoma translocation protein 1
Synonyms:
MALT lymphoma-associated translocation MALT1 MLT Paracaspase
Type:
Enzyme
Mol. Mass.:
92257.81
Organism:
Homo sapiens (Human)
Description:
Q9UDY8
Residue:
824
  
Inhibitor
Name:
BDBM355944
Synonyms:
1-(5-chloro-6-(2H- 1,2,3-triazol-2- yl)pyridin-3-yl)-3-(2- chloro-7-(5- oxaspiro[2.4]heptan- 1-yl)pyrazolo[1,5- a]pyrimidin-6-yl)urea US9815842, Example 68
Type:
Small organic molecule
Emp. Form.:
C20H17Cl2N9O2
Mol. Mass.:
486.314
SMILES:
Clc1cc2ncc(NC(=O)Nc3cnc(c(Cl)c3)-n3nccn3)c(C3CC33CCOC3)n2n1
: