Target
Mucosa-associated lymphoid tissue lymphoma translocation protein 1
Ligand
BDBM355949
Substrate
Meas. Tech.
Biochemical Assay
IC50
0.012±n/a nM
Citation
 Soldermann, CPQuancard, JSchlapbach, ASimic, OTintelnot-Blomley, MZoller, T Pyrazolo pyrimidine derivatives and their use as MALT1 inhibitors US Patent  US9815842 Publication Date 11/14/2017 
Target
Name:
Mucosa-associated lymphoid tissue lymphoma translocation protein 1
Synonyms:
MALT lymphoma-associated translocation MALT1 MLT Paracaspase
Type:
Enzyme
Mol. Mass.:
92257.81
Organism:
Homo sapiens (Human)
Description:
Q9UDY8
Residue:
824
  
Inhibitor
Name:
BDBM355949
Synonyms:
1-(5-chloro-6- methoxypyridin-3- yl)-3-(2-methyl-7-(1- methylcyclopropyl) pyrazolo[1,5- a]pyrimidin-6-yl)urea | US9815842, Example 73
Type:
Small organic molecule
Emp. Form.:
C18H19ClN6O2
Mol. Mass.:
386.835
SMILES:
COc1ncc(NC(=O)Nc2cnc3cc(C)nn3c2C2(C)CC2)cc1Cl
: