Target
Mucosa-associated lymphoid tissue lymphoma translocation protein 1
Ligand
BDBM355967
Substrate
Meas. Tech.
Biochemical Assay
IC50
0.002±n/a nM
Citation
 Soldermann, CPQuancard, JSchlapbach, ASimic, OTintelnot-Blomley, MZoller, T Pyrazolo pyrimidine derivatives and their use as MALT1 inhibitors US Patent  US9815842 Publication Date 11/14/2017 
Target
Name:
Mucosa-associated lymphoid tissue lymphoma translocation protein 1
Synonyms:
MALT lymphoma-associated translocation MALT1 MLT Paracaspase
Type:
Enzyme
Mol. Mass.:
92257.81
Organism:
Homo sapiens (Human)
Description:
Q9UDY8
Residue:
824
  
Inhibitor
Name:
BDBM355967
Synonyms:
1-(5-chloro-6-(2H- 1,2,3-triazol-2- yl)pyridin-3-yl)-3-(2- chloro-7-(2- (methoxymethyl)tetra- hydrofuran-2- yl)pyrazolo[1,5- a]pyrimidin-6-yl)urea US9815842, Example 91
Type:
Small organic molecule
Emp. Form.:
C20H19Cl2N9O3
Mol. Mass.:
504.329
SMILES:
COCC1(CCCO1)c1c(NC(=O)Nc2cnc(c(Cl)c2)-n2nccn2)cnc2cc(Cl)nn12
: