Target
Complex of Baculoviral IAP repeat-containing protein 7 [1-159,S150G] and E3 ubiquitin-protein ligase XIAP [336-348]
Ligand
BDBM17341
Substrate
BDBM17342
Meas. Tech.
Fluorescence Polarization Affinity Measurements.
pH
7.2±n/a
Temperature
295.15±n/a K
Ki
500±n/a nM
Citation
 Zobel, KWang, LVarfolomeev, EFranklin, MCElliott, LOWallweber, HJOkawa, DCFlygare, JAVucic, DFairbrother, WJDeshayes, K Design, synthesis, and biological activity of a potent Smac mimetic that sensitizes cancer cells to apoptosis by antagonizing IAPs. ACS Chem Biol 1:525-33 (2006)  
Target
Name:
Complex of Baculoviral IAP repeat-containing protein 7 [1-159,S150G] and E3 ubiquitin-protein ligase XIAP [336-348]
Synonyms:
Chimeric protein of melanoma inhibitor of apoptosis protein and XIAP-BIR3 MLXBIR3SG
Type:
Chimeric Protein
Mol. Mass.:
19011.07
Organism:
Homo sapiens (Human)
Description:
Amino acids 160-179 of MLBIR were replaced with amino acids 336-348 of XIAP-BIR3, and Ser150 of MLBIR was mutated to glycine to give MLXBIR3SG.
Residue:
172
  
Inhibitor
Name:
BDBM17341
Synonyms:
(2S)-2-[(2S)-2-[(2S)-6-amino-2-[(2S)-2-[(2S)-2-[(2S,3S)-2-{[(2S)-1-[(2S)-2-[(2S)-2-aminopropanamido]-3-methylbutanoyl]pyrrolidin-2-yl]formamido}-3-methylpentanamido]propanamido]pentanediamido]hexanamido]-3-hydroxypropanamido]pentanedioic acid L-alanyl-L-valyl-L-prolyl-L-isoleucyl-L-alanyl-L-glutaminyl-L-lysyl-L-seryl-L-glutamic acid
Type:
polypeptide
Emp. Form.:
C41H71N11O14
Mol. Mass.:
942.0677
SMILES:
CC[C@H](C)[C@H](NC(=O)[C@@H]1CCCN1C(=O)[C@@H](NC(=O)[C@H](C)N)C(C)C)C(=O)N[C@@H](C)C(=O)N[C@@H](CCC(N)=O)C(=O)N[C@@H](CCCCN)C(=O)N[C@@H](CO)C(=O)N[C@@H](CCC(O)=O)C(O)=O
:
Substrate
Name:
BDBM17342
Synonyms:
5-carboxyflourescein(5-FAM)-conjugated AVPFFAKK | AVP-diPhe-FAM
Type:
Fluorescent dye-conjugated peptide
Emp. Form.:
Mol. Mass.:
SMILES:
: