Target
High affinity nerve growth factor receptor
Ligand
BDBM356187
Substrate
Meas. Tech.
Functional Activity Assay
IC50
0.680±n/a nM
Citation
 Mitchell, HFraley, MECooke, AJStump, CAChen, YZhang, XMcComas, CCSchirripa, KMcWherter, MMercer, SPBabaoglu, KMeng, DWu, JLiu, PWood, HBBao, JLi, CSMao, QQi, Z TrkA kinase inhibitors, compositions and methods thereof US Patent  US9815846 Publication Date 11/14/2017 
Target
Name:
High affinity nerve growth factor receptor
Synonyms:
2.7.10.1 NTRK1 NTRK1_HUMAN Neurotrophic tyrosine kinase receptor type 1 Synonyms=MTC TRK1-transforming tyrosine kinase protein TRKA GN Tropomyosin alpha-3 chain/High affinity nerve growth factor receptor Tropomyosin-related kinase A (TrkA) Tyrosine kinase receptor (Trk) Tyrosine kinase receptor A (Trk A) Tyrosine kinase receptor A (TrkA) p140-TrkA
Type:
Mol. Mass.:
87498.18
Organism:
Homo sapiens (Human)
Description:
P04629
Residue:
796
  
Inhibitor
Name:
BDBM356187
Synonyms:
US9815846, Compound 187
Type:
Small organic molecule
Emp. Form.:
C27H20F4N6O3
Mol. Mass.:
552.4797
SMILES:
Cn1ccc(n1)-c1cc(C(=O)Nc2cnc(CN3C(=O)CCC3=O)nc2-c2ccccc2)c(F)cc1C(F)(F)F
: