Target
Receptor-interacting serine/threonine-protein kinase 1
Ligand
BDBM356441
Substrate
Meas. Tech.
Fluorescent Polarization Binding (FP Binding) assay
IC50
500±n/a nM
Citation
 Estrada, AAFeng, JAFox, BLeslie, CPLyssikatos, JPPozzan, ASweeney, ZKde Vicente Fidalgo, J Compounds, compositions and methods US Patent  US9815850 Publication Date 11/14/2017 
Target
Name:
Receptor-interacting serine/threonine-protein kinase 1
Synonyms:
Cell death protein RIP RIP-1 RIPK1 Receptor-interacting protein 1
Type:
Enzyme Catalytic Domain
Mol. Mass.:
75926.99
Organism:
Homo sapiens (Human)
Description:
Q13546
Residue:
671
  
Inhibitor
Name:
BDBM356441
Synonyms:
US10604535, Example 172 US9896458, No. 172
Type:
Small organic molecule
Emp. Form.:
C21H19N7O3
Mol. Mass.:
417.4207
SMILES:
C[C@H]1Oc2cccnc2N(C)C(=O)[C@H]1NC(=O)c1ncn(Cc2cccc(c2)C#N)n1
: