Target
Carnitine monooxygenase oxygenase/reductase subunit
Ligand
BDBM356497
Substrate
Meas. Tech.
BCA Protein Assay
IC50
200000±n/a nM
Citation
 Garcia-Garcia, JCHazen, SLWos, JA Compounds and methods for inhibiting production of trimethylamine US Patent  US10213407 Publication Date 2/26/2019 
Target
Name:
Carnitine monooxygenase oxygenase/reductase subunit
Synonyms:
BL21*DE3::pET30a-Ec yeaWX
Type:
Enzyme
Mol. Mass.:
Description:
Components:
This complex has 2 components.
Component 1
Name:
Carnitine monooxygenase oxygenase subunit
Synonyms:
CNTA_ECOLI yeaW
Type:
Enzyme Catalytic Domain
Mol. Mass.:
42552.77
Organism:
Escherichia coli (strain K12)
Description:
Residue:
374
  
Component 2
Name:
Carnitine monooxygenase reductase subunit
Synonyms:
CNTB_ECOLI yeaX
Type:
Enzyme Catalytic Domain
Mol. Mass.:
35651.77
Organism:
Escherichia coli (strain K12)
Description:
Residue:
321
  
Inhibitor
Name:
BDBM356497
Synonyms:
US10213407, ID 6
Type:
Small organic molecule
Emp. Form.:
C11H19BrN2O3S
Mol. Mass.:
339.249
SMILES:
[Br-].CCOC(=O)C(=O)C[N+](C)(C)CCCN=C=S
: