Target
Fibroblast growth factor receptor 3
Ligand
BDBM356514
Substrate
Meas. Tech.
FGFR3 Enzymatic Assay
IC50
<10±n/a nM
Citation
 Yao, WZhang, CXu, MZhuo, JHe, C Substituted imidazopyridazines and benzimidazoles as inhibitors of FGFR3 US Patent  US10213427 Publication Date 2/26/2019 
Target
Name:
Fibroblast growth factor receptor 3
Synonyms:
CD_antigen: CD333 FGFR3 Fibroblast growth factor receptor JTK4
Type:
Protein
Mol. Mass.:
87699.57
Organism:
Homo sapiens (Human)
Description:
P22607
Residue:
806
  
Inhibitor
Name:
BDBM356514
Synonyms:
N-[(1-Methylpiperidin-4-yl)methyl]-3-{1-[3-({[(2,2,2-trifluoroethyl)amino]carbonyl}amino)phenyl]-1H-benzimidazol-5-yl}benzamide US10813930, Ex. No. 3
Type:
Small organic molecule
Emp. Form.:
C30H31F3N6O2
Mol. Mass.:
564.6013
SMILES:
CN1CCC(CNC(=O)c2cccc(c2)-c2ccc3n(cnc3c2)-c2cccc(NC(=O)NCC(F)(F)F)c2)CC1
: