Target
Fibroblast growth factor receptor 3
Ligand
BDBM356524
Substrate
Meas. Tech.
FGFR3 Enzymatic Assay
IC50
<10±n/a nM
Citation
 Yao, WZhang, CXu, MZhuo, JHe, C Substituted imidazopyridazines and benzimidazoles as inhibitors of FGFR3 US Patent  US10213427 Publication Date 2/26/2019 
Target
Name:
Fibroblast growth factor receptor 3
Synonyms:
CD_antigen: CD333 FGFR3 Fibroblast growth factor receptor JTK4
Type:
Protein
Mol. Mass.:
87699.57
Organism:
Homo sapiens (Human)
Description:
P22607
Residue:
806
  
Inhibitor
Name:
BDBM356524
Synonyms:
N-[(1-Methyl-1H-imidazol-2-yl)methyl]-4-{1-[3-({[(2,2,2-trifluoroethyl)amino]carbonyl}amino)phenyl]-1H-benzimidazol-5-yl}benzamide US10813930, Ex. No. 13
Type:
Small organic molecule
Emp. Form.:
C28H24F3N7O2
Mol. Mass.:
547.5311
SMILES:
Cn1ccnc1CNC(=O)c1ccc(cc1)-c1ccc2n(cnc2c1)-c1cccc(NC(=O)NCC(F)(F)F)c1
: