Target
Fibroblast growth factor receptor 3
Ligand
BDBM356536
Substrate
Meas. Tech.
FGFR3 Enzymatic Assay
IC50
<10±n/a nM
Citation
 Yao, WZhang, CXu, MZhuo, JHe, C Substituted imidazopyridazines and benzimidazoles as inhibitors of FGFR3 US Patent  US10213427 Publication Date 2/26/2019 
Target
Name:
Fibroblast growth factor receptor 3
Synonyms:
CD_antigen: CD333 FGFR3 Fibroblast growth factor receptor JTK4
Type:
Protein
Mol. Mass.:
87699.57
Organism:
Homo sapiens (Human)
Description:
P22607
Residue:
806
  
Inhibitor
Name:
BDBM356536
Synonyms:
N-Pyridin-3-yl-4-(4-{1-[3-({([(2,2,2-trifluoroethyl)amino]carbonyl}amino)phenyl]-1H-benzimidazol-5-yl}-1H-pyrazol-1-yl)piperidine-1-carboxamide US10813930, Ex. No. 25
Type:
Small organic molecule
Emp. Form.:
C30H28F3N9O2
Mol. Mass.:
603.5976
SMILES:
FC(F)(F)CNC(=O)Nc1cccc(c1)-n1cnc2cc(ccc12)-c1cnn(c1)C1CCN(CC1)C(=O)Nc1cccnc1
: