Target
Fibroblast growth factor receptor 3
Ligand
BDBM356607
Substrate
Meas. Tech.
FGFR3 Enzymatic Assay
IC50
>25±n/a nM
Citation
 Yao, WZhang, CXu, MZhuo, JHe, C Substituted imidazopyridazines and benzimidazoles as inhibitors of FGFR3 US Patent  US10213427 Publication Date 2/26/2019 
Target
Name:
Fibroblast growth factor receptor 3
Synonyms:
CD_antigen: CD333 FGFR3 Fibroblast growth factor receptor JTK4
Type:
Protein
Mol. Mass.:
87699.57
Organism:
Homo sapiens (Human)
Description:
P22607
Residue:
806
  
Inhibitor
Name:
BDBM356607
Synonyms:
N-(2-Fluorobenzyl)-3-[3-(3-{[(methylamino)carbonyl]amino}phenyl)imidazo[1,2-b]pyridazin-7-yl]benzamide US10813930, Ex. No. 96
Type:
Small organic molecule
Emp. Form.:
C28H23FN6O2
Mol. Mass.:
494.5196
SMILES:
CNC(=O)Nc1cccc(c1)-c1cnc2cc(cnn12)-c1cccc(c1)C(=O)NCc1ccccc1F
: