Target
Methionine aminopeptidase 2
Ligand
BDBM17586
Substrate
Octapeptide substrate
Meas. Tech.
MetAP Enzyme Activity Assay
pH
7.4±n/a
Temperature
295.15±n/a K
IC50
6000±n/a nM
Citation
 Wang, JSheppard, GSLou, PKawai, MBaMaung, NErickson, SATucker-Garcia, LPark, CBouska, JWang, YCFrost, DTapang, PAlbert, DHMorgan, SJMorowitz, MShusterman, SMaris, JMLesniewski, RHenkin, J Tumor suppression by a rationally designed reversible inhibitor of methionine aminopeptidase-2. Cancer Res 63:7861-9 (2003) Target
Name:
Methionine aminopeptidase 2
Synonyms:
Initiation factor 2-associated 67 kDa glycoprotein MAP2_HUMAN MNPEP Methionine aminopeptidase 2 (MetAP2) P67EIF2 p67
Type:
Enzyme
Mol. Mass.:
52884.45
Organism:
Homo sapiens (Human)
Description:
P50579
Residue:
478
  
Inhibitor
Name:
BDBM17586
Synonyms:
bestatin-type inhibitor, 1 | ethyl (2S)-2-[(2S,3R)-3-amino-2-hydroxy-5-(methylsulfanyl)pentanamido]propanoate
Type:
Small organic molecule
Emp. Form.:
C11H22N2O4S
Mol. Mass.:
278.368
SMILES:
CCOC(=O)[C@H](C)NC(=O)[C@@H](O)[C@H](N)CCSC
:
Substrate
Name:
Octapeptide substrate
Synonyms:
Type:
Peptide
Mol. Mass.:
819.07
Organism:
Description:
Residue:
8
MGKVKVGV