Target
Methionine aminopeptidase 2
Ligand
BDBM17622
Substrate
Octapeptide substrate
Meas. Tech.
MetAP2 Enzyme Activity Assay
pH
7.4±n/a
Temperature
295.15±n/a K
IC50
15±n/a nM
Citation
 Wang, GTMantei, RAKawai, MTedrow, JSBarnes, DMWang, JZhang, QLou, PGarcia, LABouska, JYates, MPark, CJudge, RALesniewski, RSheppard, GSBell, RL Lead optimization of methionine aminopeptidase-2 (MetAP2) inhibitors containing sulfonamides of 5,6-disubstituted anthranilic acids. Bioorg Med Chem Lett 17:2817-22 (2007)  
Target
Name:
Methionine aminopeptidase 2
Synonyms:
Initiation factor 2-associated 67 kDa glycoprotein MAP2_HUMAN MNPEP Methionine aminopeptidase 2 (MetAP2) P67EIF2 p67
Type:
Enzyme
Mol. Mass.:
52884.45
Organism:
Homo sapiens (Human)
Description:
P50579
Residue:
478
  
Inhibitor
Name:
BDBM17622
Synonyms:
2-chloro-3-ethyl-6-[(4-fluorobenzene)sulfonamido]benzoic acid | 5,6-disubstituted anthranilic acid sulfonamide, 9n
Type:
Small organic molecule
Emp. Form.:
C15H13ClFNO4S
Mol. Mass.:
357.784
SMILES:
CCc1ccc(NS(=O)(=O)c2ccc(F)cc2)c(C(O)=O)c1Cl
:
Substrate
Name:
Octapeptide substrate
Synonyms:
Type:
Peptide
Mol. Mass.:
819.07
Organism:
Description:
Residue:
8
MGKVKVGV