Target
Apoptosis regulator Bcl-2
Ligand
BDBM356733
Substrate
Meas. Tech.
TR-FRET (Time-Resolved Fluorescence-Resonance-Energy-Transfer) assay
Ki
<0.010±n/a nM
Citation
 Catron, NLindley, DMiller, JMSchmitt, EATong, P Solid dispersions containing an apoptosis-inducing agent US Patent  US10213433 Publication Date 2/26/2019 
Target
Name:
Apoptosis regulator Bcl-2
Synonyms:
Apoptosis regulator Bcl-2 Protein BCL-2 BCL2_HUMAN | Bcl-2 Protein
Type:
Homodimer or heterodimer
Mol. Mass.:
26269.11
Organism:
Homo sapiens (Human)
Description:
P10415
Residue:
239
  
Inhibitor
Name:
BDBM356733
Synonyms:
4-(4-{[2-(4-chlorophenyl)-4,4-dimethylcyclohex-1-en-1-yl]methyl}piperazin-1-yl)-N-{[4-({1-[cis-3-fluorotetrahydro-2H-pyran-4-yl]piperidin-4-yl}amino)-3-nitrophenyl]sulfonyl}-2-(1H-pyrrolo[2,3-b]pyridin-5-yloxy)benzamide US20240043404, Example 115
Type:
Small organic molecule
Emp. Form.:
C49H56ClFN8O7S
Mol. Mass.:
955.535
SMILES:
CC1(C)CCC(CN2CCN(CC2)c2ccc(C(=O)NS(=O)(=O)c3ccc(NC4CCN(CC4)[C@@H]4CCOC[C@@H]4F)c(c3)[N+]([O-])=O)c(Oc3cnc4[nH]ccc4c3)c2)=C(C1)c1ccc(Cl)cc1
: