Target
Apoptosis regulator Bcl-2
Ligand
BDBM189557
Substrate
Meas. Tech.
TR-FRET (Time-Resolved Fluorescence-Resonance-Energy-Transfer) assay
Ki
<0.010±n/a nM
Citation
 Catron, NLindley, DMiller, JMSchmitt, EATong, P Solid dispersions containing an apoptosis-inducing agent US Patent  US10213433 Publication Date 2/26/2019 
Target
Name:
Apoptosis regulator Bcl-2
Synonyms:
Apoptosis regulator Bcl-2 Protein BCL-2 BCL2_HUMAN | Bcl-2 Protein
Type:
Homodimer or heterodimer
Mol. Mass.:
26269.11
Organism:
Homo sapiens (Human)
Description:
P10415
Residue:
239
  
Inhibitor
Name:
BDBM189557
Synonyms:
US10213433, Compound 119 US20240043404, Example 119 | US9174982, 119
Type:
Small organic molecule
Emp. Form.:
C45H48ClFN6O8S
Mol. Mass.:
887.414
SMILES:
CC1(C)CCC(=C(CN2CCN(CC2)c2ccc(C(=O)NS(=O)(=O)c3ccc(OCC4(F)CCOCC4)c(c3)[N+]([O-])=O)c(Oc3cnc4[nH]ccc4c3)c2)C1)c1ccc(Cl)cc1
: