Target
Tyrosine-protein kinase Lck
Ligand
BDBM17715
Substrate
biotinylated gastrin substrate
Meas. Tech.
HTRF Kinase Inhibition Assay
pH
7.5±n/a
Temperature
295.15±n/a K
IC50
2100±n/a nM
Citation
 Martin, MWNewcomb, JNunes, JJBemis, JEMcGowan, DCWhite, RDBuchanan, JLDiMauro, EFBoucher, CFaust, THsieh, FHuang, XLee, JHSchneider, STurci, SMZhu, X Discovery of novel 2,3-diarylfuro[2,3-b]pyridin-4-amines as potent and selective inhibitors of Lck: synthesis, SAR, and pharmacokinetic properties. Bioorg Med Chem Lett 17:2299-304 (2007)  
Target
Name:
Tyrosine-protein kinase Lck
Synonyms:
2.7.10.2 LCK_HUMAN Leukocyte C-terminal Src kinase Lymphocyte-specific protein tyrosine kinase Protein YT16 Proto-oncogene tyrosine-protein kinase LCK T cell-specific protein-tyrosine kinase
Type:
Mol. Mass.:
57987.83
Organism:
Homo sapiens (Human)
Description:
P06239
Residue:
509
  
Inhibitor
Name:
BDBM17715
Synonyms:
2,3-Diarylfuro[2,3-b]pyridine-4-amine, 6 | N-[(2S)-oxolan-2-ylmethyl]-2,3-diphenylfuro[2,3-b]pyridin-4-amine
Type:
Small organic molecule
Emp. Form.:
C24H22N2O2
Mol. Mass.:
370.4437
SMILES:
C(Nc1ccnc2oc(c(-c3ccccc3)c12)-c1ccccc1)[C@@H]1CCCO1
:
Substrate
Name:
biotinylated gastrin substrate
Synonyms:
Type:
Peptide
Mol. Mass.:
2100.22
Organism:
Description:
Residue:
17
ITINYLEEEEAYGWLDF