Target
Activated CDC42 kinase 1
Ligand
BDBM17723
Substrate
Not Specified
Meas. Tech.
HTRF Kinase Inhibition Assay
IC50
20±n/a nM
Citation
 Martin, MWNewcomb, JNunes, JJBemis, JEMcGowan, DCWhite, RDBuchanan, JLDiMauro, EFBoucher, CFaust, THsieh, FHuang, XLee, JHSchneider, STurci, SMZhu, X Discovery of novel 2,3-diarylfuro[2,3-b]pyridin-4-amines as potent and selective inhibitors of Lck: synthesis, SAR, and pharmacokinetic properties. Bioorg Med Chem Lett 17:2299-304 (2007)  
Target
Name:
Activated CDC42 kinase 1
Synonyms:
ACK1 Activated CDC42 kinase 1 (ACK-1) Tyrosine kinase non-receptor protein 2
Type:
Protein
Mol. Mass.:
114577.86
Organism:
Homo sapiens (Human)
Description:
Q07912
Residue:
1038
  
Inhibitor
Name:
BDBM17723
Synonyms:
2,3-Diarylfuro[2,3-b]pyridine-4-amine, 19 | 3-phenyl-2-{4-[2-(piperidin-1-yl)ethoxy]phenyl}-N-[2-(pyridin-3-yl)ethyl]furo[2,3-b]pyridin-4-amine
Type:
Small organic molecule
Emp. Form.:
C33H34N4O2
Mol. Mass.:
518.6487
SMILES:
C(Cc1cccnc1)Nc1ccnc2oc(c(-c3ccccc3)c12)-c1ccc(OCCN2CCCCC2)cc1
:
Substrate
Name:
Not Specified
Synonyms:
Type:
Mol. Mass.:
358.43
Organism:
Description:
Residue:
3
NA