Target
Lysine-specific histone demethylase 1A
Ligand
BDBM356673
Substrate
Meas. Tech.
Biological Assays-Inhibition of LSD1
IC50
27.0±n/a nM
Citation
 Ortega Muñoz, AFyfe, MCMartinell Pedemonte, MEstiarte Martinez, MValls Vidal, NKurz, GCastro Palomino Laria, JC (Hetero)aryl cyclopropylamine compounds as LSD1 inhibitors US Patent  US10214477 Publication Date 2/26/2019 
Target
Name:
Lysine-specific histone demethylase 1A
Synonyms:
AOF2 Flavin-containing amine oxidase domain-containing protein 2 KDM1A KIAA0601 Lysine-specific demethylase 1 (LSD1) Lysine-specific histone demethylase 1 (LSD1)
Type:
Enzyme
Mol. Mass.:
92901.01
Organism:
Homo sapiens (Human)
Description:
O60341
Residue:
852
  
Inhibitor
Name:
BDBM356673
Synonyms:
N-(4′-((trans)-2-((4-aminocyclohexyl)amino)cyclopropyl)-6-methoxy-[1,1′-biphenyl]-3-yl)methanesulfonamide | US10214477, Example 48
Type:
Small organic molecule
Emp. Form.:
C23H31N3O3S
Mol. Mass.:
429.576
SMILES:
COc1ccc(NS(C)(=O)=O)cc1-c1ccc(cc1)C1CC1N[C@H]1CC[C@H](N)CC1
: