Target
Serine/threonine-protein kinase mTOR
Ligand
BDBM228210
Substrate
Meas. Tech.
mTOR Kinase Activity Assay
IC50
550±n/a nM
Citation
 Zhang, XJi, QWang, LGao, CWang, EDu, ZGong, LChen, B Imidazolone derivatives, pharmaceutical compositions and uses thereof US Patent  US10047084 Publication Date 8/14/2018 
Target
Name:
Serine/threonine-protein kinase mTOR
Synonyms:
FK506-binding protein 12-rapamycin complex-associated protein 1 FRAP FRAP1 MTOR Mammalian Target of Rapamycin (mTOR) RAFT1 Rapamycin and FKBP12 target 1 Serine/threonine-protein kinase (mTOR) | mTORC2
Type:
Rapamycin target protein
Mol. Mass.:
288917.12
Organism:
Homo sapiens (Human)
Description:
P42345
Residue:
2549
  
Inhibitor
Name:
BDBM228210
Synonyms:
3-methyl-8-(6-(1-methyl-1H-pyrazol-4-yl)pyridin-3-yl)-1-(1-methylpyrrolidin-3-yl)-1H-imidazo[4,5-c]quinolin-2(3H)-one | US10047084, 9
Type:
Small organic molecule
Emp. Form.:
C25H25N7O
Mol. Mass.:
439.5123
SMILES:
CN1CCC(C1)n1c2c(cnc3ccc(cc23)-c2ccc(nc2)-c2cnn(C)c2)n(C)c1=O
: