Target
Serine/threonine-protein kinase mTOR
Ligand
BDBM228234
Substrate
Meas. Tech.
mTOR Kinase Activity Assay
IC50
55.0±n/a nM
Citation
 Zhang, XJi, QWang, LGao, CWang, EDu, ZGong, LChen, B Imidazolone derivatives, pharmaceutical compositions and uses thereof US Patent  US10047084 Publication Date 8/14/2018 
Target
Name:
Serine/threonine-protein kinase mTOR
Synonyms:
FK506-binding protein 12-rapamycin complex-associated protein 1 FRAP FRAP1 MTOR Mammalian Target of Rapamycin (mTOR) RAFT1 Rapamycin and FKBP12 target 1 Serine/threonine-protein kinase (mTOR) | mTORC2
Type:
Rapamycin target protein
Mol. Mass.:
288917.12
Organism:
Homo sapiens (Human)
Description:
P42345
Residue:
2549
  
Inhibitor
Name:
BDBM228234
Synonyms:
1-((1r,4r)-4-hydroxycyclohexyl)-3-methyl-8-(1-phenyl-1H-pyrazol-4-yl)-1H-imidazo[4,5-c]quinolin-2(3H)-one | US10047084, 23
Type:
Small organic molecule
Emp. Form.:
C26H25N5O2
Mol. Mass.:
439.509
SMILES:
Cn1c2cnc3ccc(cc3c2n([C@H]2CC[C@H](O)CC2)c1=O)-c1cnn(c1)-c1ccccc1
: