Target
Serine/threonine-protein kinase mTOR
Ligand
BDBM228253
Substrate
Meas. Tech.
mTOR Kinase Activity Assay
IC50
<10.00±n/a nM
Citation
 Zhang, XJi, QWang, LGao, CWang, EDu, ZGong, LChen, B Imidazolone derivatives, pharmaceutical compositions and uses thereof US Patent  US10047084 Publication Date 8/14/2018 
Target
Name:
Serine/threonine-protein kinase mTOR
Synonyms:
FK506-binding protein 12-rapamycin complex-associated protein 1 FRAP FRAP1 MTOR Mammalian Target of Rapamycin (mTOR) RAFT1 Rapamycin and FKBP12 target 1 Serine/threonine-protein kinase (mTOR) | mTORC2
Type:
Rapamycin target protein
Mol. Mass.:
288917.12
Organism:
Homo sapiens (Human)
Description:
P42345
Residue:
2549
  
Inhibitor
Name:
BDBM228253
Synonyms:
(1s,4s)-4-(3-methyl-8-(6-(1-methyl-1H-pyrazol-4-yl)pyridin-3-yl)-2-oxo-2,3-dihydro-1H-imidazo[4,5-c]quinolin-1-yl)cyclohexanecarboxylic acid | US10047084, 35
Type:
Small organic molecule
Emp. Form.:
C27H26N6O3
Mol. Mass.:
482.5337
SMILES:
Cn1cc(cn1)-c1ccc(cn1)-c1ccc2ncc3n(C)c(=O)n([C@@H]4CC[C@@H](CC4)C(O)=O)c3c2c1
: