Target
Phosphatidylinositol 3-kinase regulatory subunit alpha
Ligand
BDBM228245
Substrate
Meas. Tech.
PI3K-alpha Enzyme Activity Assay
IC50
<10.00±n/a nM
Citation
 Zhang, XJi, QWang, LGao, CWang, EDu, ZGong, LChen, B Imidazolone derivatives, pharmaceutical compositions and uses thereof US Patent  US10047084 Publication Date 8/14/2018 
Target
Name:
Phosphatidylinositol 3-kinase regulatory subunit alpha
Synonyms:
GRB1 PI3-kinase class I PI3-kinase p85-alpha subunit PI3-kinase subunit p85-alpha PIK3CG/PIK3R1 Phosphatidylinositol 3-kinase 85 kDa regulatory subunit alpha (PI3K alpha) Phosphatidylinositol 3-kinase regulatory subunit alpha (PIK3R1) Phosphatidylinositol 3-kinase regulatory subunit alpha isoform 1 (PI3 Kinase alpha) Phosphatidylinositol 4,5-bisphosphate 3-kinase catalytic subunit alpha isoform (PI3Kalpha) PtdIns-3-kinase p85-alpha p85 alpha
Type:
Protein
Mol. Mass.:
83592.82
Organism:
Homo sapiens (Human)
Description:
P27986
Residue:
724
  
Inhibitor
Name:
BDBM228245
Synonyms:
(S)-3-methyl-8-(6-(1-methyl-1H-pyrazol-4-yl)pyridin-3-yl)-1-(1-(methanesulfonyl)pyrrolidin-3-yl)-1H-imidazo[4,5-c]quinolin-2(3H)-one | US10047084, 28
Type:
Small organic molecule
Emp. Form.:
C25H25N7O3S
Mol. Mass.:
503.576
SMILES:
Cn1cc(cn1)-c1ccc(cn1)-c1ccc2ncc3n(C)c(=O)n([C@H]4CCN(C4)S(C)(=O)=O)c3c2c1
: