Target
Monocarboxylate transporter 4
Ligand
BDBM356873
Substrate
Meas. Tech.
MCT4-Mediated Lactate Transport in MDA-MB-231 Breast Cancer Cells
IC50
0.300±n/a nM
Citation
 Parnell, KMMcCall, JRomero, D Heterocyclic inhibitors of MCT4 US Patent  US10214492 Publication Date 2/26/2019 
Target
Name:
Monocarboxylate transporter 4
Synonyms:
MCT 4 MCT4 SLC16A3 | Solute carrier family 16 member 3
Type:
PROTEIN
Mol. Mass.:
49474.36
Organism:
Homo sapiens (Human)
Description:
ChEMBL_104604
Residue:
465
  
Inhibitor
Name:
BDBM356873
Synonyms:
US10214492, Example 223 | US11292767, Example 223
Type:
Small organic molecule
Emp. Form.:
C28H34N4O4
Mol. Mass.:
490.594
SMILES:
CC[C@@](C)(OCc1cc(-c2cccc(OCC(C)(C)C)c2)n(n1)-c1cccc2cnn(C)c12)C(O)=O
: