Target
Period circadian protein homolog 2
Ligand
BDBM356919
Substrate
Meas. Tech.
Per2 Assay
EC50
373±n/a nM
Citation
 Bersot, RHumphries, P Carbazole-containing amides, carbamates, and ureas as cryptochrome modulators US Patent  US10214507 Publication Date 2/26/2019 
Target
Name:
Period circadian protein homolog 2
Synonyms:
Circadian clock protein PERIOD 2 PER2 Period circadian protein homolog 2 | hPER2
Type:
PROTEIN
Mol. Mass.:
136576.47
Organism:
Homo sapiens (Human)
Description:
ChEMBL_116705
Residue:
1255
  
Inhibitor
Name:
BDBM356919
Synonyms:
1-(3-(3,6-difluoro- 9H-carbazol-9-yl)-2- hydroxypropyl)-4- isopropylpyrrolidin- 2-one US10759777, Compound 41
Type:
Small organic molecule
Emp. Form.:
C22H24F2N2O2
Mol. Mass.:
386.435
SMILES:
CC(C)C1CN(CC(O)Cn2c3ccc(F)cc3c3cc(F)ccc23)C(=O)C1
: