Target
Period circadian protein homolog 2
Ligand
BDBM356940
Substrate
Meas. Tech.
Per2 Assay
EC50
302±n/a nM
Citation
 Bersot, RHumphries, P Carbazole-containing amides, carbamates, and ureas as cryptochrome modulators US Patent  US10214507 Publication Date 2/26/2019 
Target
Name:
Period circadian protein homolog 2
Synonyms:
Circadian clock protein PERIOD 2 PER2 Period circadian protein homolog 2 | hPER2
Type:
PROTEIN
Mol. Mass.:
136576.47
Organism:
Homo sapiens (Human)
Description:
ChEMBL_116705
Residue:
1255
  
Inhibitor
Name:
BDBM356940
Synonyms:
(S)-1-((R)-3-(3,6- difluoro-9H- carbazol-9-yl)-2- hydroxypropyl)-3- fluoropyrrolidin-2- one US10759777, Compound 120
Type:
Small organic molecule
Emp. Form.:
C19H17F3N2O2
Mol. Mass.:
362.3457
SMILES:
O[C@@H](CN1CC[C@H](F)C1=O)Cn1c2ccc(F)cc2c2cc(F)ccc12
: