Target
Period circadian protein homolog 2
Ligand
BDBM356950
Substrate
Meas. Tech.
Per2 Assay
EC50
451±n/a nM
Citation
 Bersot, RHumphries, P Carbazole-containing amides, carbamates, and ureas as cryptochrome modulators US Patent  US10214507 Publication Date 2/26/2019 
Target
Name:
Period circadian protein homolog 2
Synonyms:
Circadian clock protein PERIOD 2 PER2 Period circadian protein homolog 2 | hPER2
Type:
PROTEIN
Mol. Mass.:
136576.47
Organism:
Homo sapiens (Human)
Description:
ChEMBL_116705
Residue:
1255
  
Inhibitor
Name:
BDBM356950
Synonyms:
(S)-1-((S)-3-(3,6- difluoro-9H- carbazol-9-yl)-2- hydroxy-2- methylpropyl)-3- fluoropyrrolidin-2- one US10759777, Compound 125
Type:
Small organic molecule
Emp. Form.:
C20H19F3N2O2
Mol. Mass.:
376.3723
SMILES:
CC(O)(CN1CC[C@H](F)C1=O)Cn1c2ccc(F)cc2c2cc(F)ccc12
: