Target
Macrophage colony-stimulating factor 1 receptor [538-972]
Ligand
BDBM17015
Substrate
Macrophage colony-stimulating factor 1 receptor (CSF1R)
Meas. Tech.
cFMs Autophosphorylation Fluorescence Polarization End Point Assay.
pH
7.5±n/a
Temperature
295.15±n/a K
IC50
1200±100 nM
Citation
 Schalk-Hihi, CMa, HCStruble, GTBayoumy, SWilliams, RDevine, EPetrounia, IPMezzasalma, TZeng, LSchubert, CGrasberger, BSpringer, BADeckman, IC Protein engineering of the colony-stimulating factor-1 receptor kinase domain for structural studies. J Biol Chem 282:4085-93 (2007)  
Target
Name:
Macrophage colony-stimulating factor 1 receptor [538-972]
Synonyms:
CSF1R FMS Macrophage colony-stimulating factor 1 receptor (aa 538-972)
Type:
Mol. Mass.:
48843.65
Organism:
Description:
P07333 aa 538-972
Residue:
435
 
Inhibitor
Name:
BDBM17015
Synonyms:
(3Z)-3-(1H-pyrrol-2-ylmethylidene)-2,3-dihydro-1H-indol-2-one Indolinone based inhibitor, 1 | Oxindole I
Type:
Small organic molecule
Emp. Form.:
C13H10N2O
Mol. Mass.:
210.2313
SMILES:
O=C1Nc2ccccc2\C1=C\c1ccc[nH]1
:
Substrate
Name:
Macrophage colony-stimulating factor 1 receptor
Synonyms:
CSF1R FMS Macrophage colony stimulating factor receptor Macrophage colony-stimulating factor 1 receptor (c-FMS) Proto-oncogene c-Fms c-fms | cFMS
Type:
Protein
Mol. Mass.:
107979.48
Organism:
Homo sapiens (Human)
Description:
P07333
Residue:
972