Target
Macrophage colony-stimulating factor 1 receptor [538-678,753-922]
Ligand
BDBM7393
Substrate
cFMS -Tie-2 Chimera
Meas. Tech.
cFMs Autophosphorylation Fluorescence Polarization End Point Assay.
pH
7.5±n/a
Temperature
295.15±n/a K
IC50
4500±500 nM
Citation
 Schalk-Hihi, CMa, HCStruble, GTBayoumy, SWilliams, RDevine, EPetrounia, IPMezzasalma, TZeng, LSchubert, CGrasberger, BSpringer, BADeckman, IC Protein engineering of the colony-stimulating factor-1 receptor kinase domain for structural studies. J Biol Chem 282:4085-93 (2007)  
Target
Name:
Macrophage colony-stimulating factor 1 receptor [538-678,753-922]
Synonyms:
6His.FMS.538-922(TIE2) CSF1R_HUMAN Tyrosine Kinase CSF1-R Mutant (Tie2 KID Chimera) | cFMS -Tie-2 Chimera
Type:
Other Protein Type
Mol. Mass.:
37574.75
Organism:
Homo sapiens (Human)
Description:
Recombinant protein contains FMS cytoplasmic domain (FMS538-922.6His), in which FMS KID was replaced with Tie-2 KID.
Residue:
333
  
Inhibitor
Name:
BDBM7393
Synonyms:
3-[(2Z,3E)-3-(hydroxyimino)-2,3-dihydro-1H-indol-2-ylidene]-2,3-dihydro-1H-indol-2-one Indirubin-3 -monoxime Indirubin-3monoxime | indirubin deriv. 7h
Type:
Emp. Form.:
C16H11N3O2
Mol. Mass.:
277.2774
SMILES:
O=Nc1c([nH]c2ccccc12)C1C(=O)Nc2ccccc12
:
Substrate
Name:
Macrophage colony-stimulating factor 1 receptor [538-678,753-922]
Synonyms:
6His.FMS.538-922(TIE2) CSF1R_HUMAN Tyrosine Kinase CSF1-R Mutant (Tie2 KID Chimera) | cFMS -Tie-2 Chimera
Type:
Other Protein Type
Mol. Mass.:
37574.75
Organism:
Homo sapiens (Human)
Description:
Recombinant protein contains FMS cytoplasmic domain (FMS538-922.6His), in which FMS KID was replaced with Tie-2 KID.
Residue:
333