Target
Sodium channel protein type 5 subunit alpha
Ligand
BDBM356996
Substrate
Meas. Tech.
Nav1.7 and Nav1.5 Screening Assay
IC50
>33000±n/a nM
Citation
 Duffy, JChambers, MSRae, AOsborne, JLemasson, IAGoldsmith, MDSharpe, AFonquerna Pou, S Amino-substituted heterocyclic derivatives as sodium channel inhibitors US Patent  US10214509 Publication Date 2/26/2019 
Target
Name:
Sodium channel protein type 5 subunit alpha
Synonyms:
HH1 SCN5A_HUMAN Sodium channel protein type 5 subunit alpha/beta-1/beta-2 Voltage-gated sodium channel subunit alpha Nav1.5
Type:
Enzyme
Mol. Mass.:
226908.60
Organism:
Homo sapiens (Human)
Description:
Q14524
Residue:
2016
  
Inhibitor
Name:
BDBM356996
Synonyms:
5-Amino-N-(4-chloro-2-fluoro-phenyl)-1-(o-tolyl)-1H-pyrazole-4-carboxamide | US10214509, Example 7
Type:
Small organic molecule
Emp. Form.:
C17H14ClFN4O
Mol. Mass.:
344.771
SMILES:
Cc1ccccc1-n1ncc(C(=O)Nc2ccc(Cl)cc2F)c1N
: