Target
Serine/threonine-protein kinase pim-1
Ligand
BDBM242373
Substrate
Meas. Tech.
Pim-1 Kinase Inhibition Assay
Temperature
298.15±n/a K
IC50
103±n/a nM
Comments
extracted
Citation
 Xu, YBrenning, BGKultgen, SGLiu, XSaunders, MDHo, K Substituted imidazo[1,2-B]pyridazines as protein kinase inhibitors US Patent  US10047093 Publication Date 8/14/2018 
Target
Name:
Serine/threonine-protein kinase pim-1
Synonyms:
PIM-1 Kinase PIM1_HUMAN Serine/threonine-protein kinase (PIM1) Serine/threonine-protein kinase PIM1 | Serine/threonine-protein kinase pim-1 (PIM1)
Type:
Protein
Mol. Mass.:
35681.82
Organism:
Homo sapiens (Human)
Description:
P11309
Residue:
313
  
Inhibitor
Name:
BDBM242373
Synonyms:
US10047093, 8-30 US10875864, EX. 8-30 | US9416132, 8-30
Type:
Small organic molecule
Emp. Form.:
C20H21F3N4O
Mol. Mass.:
390.4021
SMILES:
C[C@]1(O)CC[C@@H](CC1)Nc1ccc2ncc(-c3cccc(c3)C(F)(F)F)n2n1
: