Target
Potassium voltage-gated channel subfamily H member 2
Ligand
BDBM228355
Substrate
Meas. Tech.
hERG Activity Assays
IC50
>30000±n/a nM
Citation
 Xu, YBrenning, BGKultgen, SGLiu, XSaunders, MDHo, K Substituted imidazo[1,2-B]pyridazines as protein kinase inhibitors US Patent  US10047093 Publication Date 8/14/2018 
Target
Name:
Potassium voltage-gated channel subfamily H member 2
Synonyms:
1,3-beta-glucan synthase component GLS2 ERG Eag-related protein 1 Ether-a-go-go-related gene (HERG) Ether-a-go-go-related gene potassium channel 1 Ether-a-go-go-related gene potassium channel 1 (hERG1) Ether-a-go-go-related protein 1 H-ERG KCNH2 Potassium voltage-gated channel subfamily H member 2 (hERG) Voltage-gated potassium channel subunit Kv11.1 hERG Potassium Channel 1 | putative potassium channel subunit
Type:
Multi-pass membrane protein
Mol. Mass.:
126672.65
Organism:
Homo sapiens (Human)
Description:
Q12809
Residue:
1159
  
Inhibitor
Name:
BDBM228355
Synonyms:
US10047093, 8-64 US10875864, EX. 8-64
Type:
Small organic molecule
Emp. Form.:
C19H21ClN4O
Mol. Mass.:
356.849
SMILES:
OC[C@H]1CC[C@@H](CC1)Nc1ccn2ncc(-c3cccc(Cl)c3)c2n1
: