Target
Coagulation factor XI
Ligand
BDBM357161
Substrate
Meas. Tech.
Factor XIa Assay
Ki
0.080±n/a nM
Citation
 Xu, JAli, AZhou, WGao, YEdmondson, SDMertz, ENeelamkavil, SFLiu, WSun, WShen, DHarper, BZhu, CBara, TLim, YYang, M Factor XIA inhibitors US Patent  US10214512 Publication Date 2/26/2019 
Target
Name:
Coagulation factor XI
Synonyms:
Coagulation factor XIa Coagulation factor XIa light chain FA11_HUMAN Factor XIa PTA | Plasma thromboplastin antecedent
Type:
Enzyme
Mol. Mass.:
70130.58
Organism:
Homo sapiens (Human)
Description:
P03951
Residue:
625
  
Inhibitor
Name:
BDBM357161
Synonyms:
US10214512, Example 117
Type:
Small organic molecule
Emp. Form.:
C29H26FN9O4
Mol. Mass.:
583.573
SMILES:
COC(=O)Nc1ccc2-c3c[nH]c(n3)[C@H](CCCCC(=O)Nc2c1)c1ccc(c[n+]1[O-])-c1cc(F)ccc1-n1cnnn1
: