Target
Dimer of Gag-Pol polyprotein [491-589,Q498K,D521N,V555I,N579D]
Ligand
BDBM17829
Substrate
HIV-1 Protease Substrate
Meas. Tech.
Enzyme Inhibition Assay
Ki
3.9±n/a nM
Citation
 Reddy, GSAli, ANalam, MNAnjum, SGCao, HNathans, RSSchiffer, CARana, TM Design and Synthesis of HIV-1 Protease Inhibitors Incorporating Oxazolidinones as P2/P2' Ligands in Pseudosymmetric Dipeptide Isosteres. J Med Chem 50:4316-28 (2007)  
Target
Name:
Dimer of Gag-Pol polyprotein [491-589,Q498K,D521N,V555I,N579D]
Synonyms:
HIV-1 Protease Mutant M2 (D30N, L63P, N88D)
Type:
Protein Complex
Mol. Mass.:
Description:
Components:
This complex has 2 components.
Component 1
Name:
Gag-Pol polyprotein [491-589,Q498K,D521N,V555I,N579D]
Synonyms:
HIV-1 Protease Mutant M2 (D30N, L63P, N88D) chain A POL_HV1A2 | gag-pol
Type:
Enzyme Subunit
Mol. Mass.:
10807.22
Organism:
Human immunodeficiency virus type 1
Description:
P03369[491-589,Q498K,D521N,V555I,N579D]
Residue:
99
  
Component 2
Name:
Gag-Pol polyprotein [491-589,Q498K,D521N,V555I,N579D]
Synonyms:
HIV-1 Protease Mutant M2 (D30N, L63P, N88D) chain A POL_HV1A2 | gag-pol
Type:
Enzyme Subunit
Mol. Mass.:
10807.22
Organism:
Human immunodeficiency virus type 1
Description:
P03369[491-589,Q498K,D521N,V555I,N579D]
Residue:
99
  
Inhibitor
Name:
BDBM17829
Synonyms:
(2S)-N-[(2S,4S,5S)-5-{[(5S)-3-(3,4-difluorophenyl)-2-oxo-1,3-oxazolidin-5-yl]formamido}-4-hydroxy-1,6-diphenylhexan-2-yl]-2-acetamido-3-methylbutanamide | Hydroxyethylene Isostere-Based Compound, 13c
Type:
Small organic molecule
Emp. Form.:
C35H40F2N4O6
Mol. Mass.:
650.7121
SMILES:
CC(C)[C@H](NC(C)=O)C(=O)N[C@H](C[C@H](O)[C@H](Cc1ccccc1)NC(=O)[C@@H]1CN(C(=O)O1)c1ccc(F)c(F)c1)Cc1ccccc1
:
Substrate
Name:
HIV-1 Protease Substrate
Synonyms:
Type:
Peptide
Mol. Mass.:
4728.18
Organism:
Description:
Residue:
44