Target
Dimer of Gag-Pol polyprotein [491-589,Q498K,D521N,V555I,N579D]
Ligand
BDBM17832
Substrate
HIV-1 Protease Substrate
Meas. Tech.
Enzyme Inhibition Assay
Ki
13.9±n/a nM
Citation
 Reddy, GSAli, ANalam, MNAnjum, SGCao, HNathans, RSSchiffer, CARana, TM Design and Synthesis of HIV-1 Protease Inhibitors Incorporating Oxazolidinones as P2/P2' Ligands in Pseudosymmetric Dipeptide Isosteres. J Med Chem 50:4316-28 (2007)  
Target
Name:
Dimer of Gag-Pol polyprotein [491-589,Q498K,D521N,V555I,N579D]
Synonyms:
HIV-1 Protease Mutant M2 (D30N, L63P, N88D)
Type:
Protein Complex
Mol. Mass.:
Description:
Components:
This complex has 2 components.
Component 1
Name:
Gag-Pol polyprotein [491-589,Q498K,D521N,V555I,N579D]
Synonyms:
HIV-1 Protease Mutant M2 (D30N, L63P, N88D) chain A POL_HV1A2 | gag-pol
Type:
Enzyme Subunit
Mol. Mass.:
10807.22
Organism:
Human immunodeficiency virus type 1
Description:
P03369[491-589,Q498K,D521N,V555I,N579D]
Residue:
99
  
Component 2
Name:
Gag-Pol polyprotein [491-589,Q498K,D521N,V555I,N579D]
Synonyms:
HIV-1 Protease Mutant M2 (D30N, L63P, N88D) chain A POL_HV1A2 | gag-pol
Type:
Enzyme Subunit
Mol. Mass.:
10807.22
Organism:
Human immunodeficiency virus type 1
Description:
P03369[491-589,Q498K,D521N,V555I,N579D]
Residue:
99
  
Inhibitor
Name:
BDBM17832
Synonyms:
(2S)-N-[(2S,4S,5S)-4-hydroxy-5-{[(5S)-2-oxo-3-phenyl-1,3-oxazolidin-5-yl]formamido}-1,6-diphenylhexan-2-yl]-3-methyl-2-(2-oxo-1,3-diazinan-1-yl)butanamide | Hydroxyethylene Isostere-Based Compound, 14a
Type:
Small organic molecule
Emp. Form.:
C37H45N5O6
Mol. Mass.:
655.7831
SMILES:
CC(C)[C@H](N1CCCNC1=O)C(=O)N[C@H](C[C@H](O)[C@H](Cc1ccccc1)NC(=O)[C@@H]1CN(C(=O)O1)c1ccccc1)Cc1ccccc1
:
Substrate
Name:
HIV-1 Protease Substrate
Synonyms:
Type:
Peptide
Mol. Mass.:
4728.18
Organism:
Description:
Residue:
44