Target
Dimer of Gag-Pol polyprotein [491-589,Q498K,L501I,V555I,A562V,G564S,I575V,L581M]
Ligand
BDBM17838
Substrate
HIV-1 Protease Substrate
Meas. Tech.
Enzyme Inhibition Assay
Ki
447±n/a nM
Citation
 Reddy, GSAli, ANalam, MNAnjum, SGCao, HNathans, RSSchiffer, CARana, TM Design and Synthesis of HIV-1 Protease Inhibitors Incorporating Oxazolidinones as P2/P2' Ligands in Pseudosymmetric Dipeptide Isosteres. J Med Chem 50:4316-28 (2007)  
Target
Name:
Dimer of Gag-Pol polyprotein [491-589,Q498K,L501I,V555I,A562V,G564S,I575V,L581M]
Synonyms:
HIV-1 Protease Mutant M3 (L10I, L63P, A71V, G73S, I84V, L90M)
Type:
Protein Complex
Mol. Mass.:
Description:
Components:
This complex has 2 components.
Component 1
Name:
Gag-Pol polyprotein [491-589,Q498K,L501I,V555I,A562V,G564S,I575V,L581M]
Synonyms:
HIV-1 Protease Mutant M3 (Q7K,L10I, V64I, A71V, G73S, I84V, L90M) chain A POL_HV1A2 | gag-pol
Type:
Enzyme Subunit
Mol. Mass.:
10869.31
Organism:
Human immunodeficiency virus type 1
Description:
O38732 mutant
Residue:
99
  
Component 2
Name:
Gag-Pol polyprotein [491-589,Q498K,L501I,V555I,A562V,G564S,I575V,L581M]
Synonyms:
HIV-1 Protease Mutant M3 (Q7K,L10I, V64I, A71V, G73S, I84V, L90M) chain A POL_HV1A2 | gag-pol
Type:
Enzyme Subunit
Mol. Mass.:
10869.31
Organism:
Human immunodeficiency virus type 1
Description:
O38732 mutant
Residue:
99
  
Inhibitor
Name:
BDBM17838
Synonyms:
2-(2,6-dimethylphenoxy)-N-[(2S,3S,5S)-3-hydroxy-5-{[(5S)-2-oxo-3-phenyl-1,3-oxazolidin-5-yl]formamido}-1,6-diphenylhexan-2-yl]acetamide | Hydroxyethylene Isostere-Based Compound, 22a
Type:
Small organic molecule
Emp. Form.:
C38H41N3O6
Mol. Mass.:
635.7486
SMILES:
Cc1cccc(C)c1OCC(=O)N[C@@H](Cc1ccccc1)[C@@H](O)C[C@H](Cc1ccccc1)NC(=O)[C@@H]1CN(C(=O)O1)c1ccccc1
:
Substrate
Name:
HIV-1 Protease Substrate
Synonyms:
Type:
Peptide
Mol. Mass.:
4728.18
Organism:
Description:
Residue:
44