Target
Fibroblast growth factor receptor 3
Ligand
BDBM357246
Substrate
Meas. Tech.
Determination of the Effects of the Compounds of the Present Invention on FGFR Kinase Activity
IC50
22.0±n/a nM
Citation
 Chen, LGuan, DBai, HYan, XMiao, SZhu, S Substituted pyrazoles as inhibitors of fibroblast growth factor receptor US Patent  US10214515 Publication Date 2/26/2019 
Target
Name:
Fibroblast growth factor receptor 3
Synonyms:
CD_antigen: CD333 FGFR3 Fibroblast growth factor receptor JTK4
Type:
Protein
Mol. Mass.:
87699.57
Organism:
Homo sapiens (Human)
Description:
P22607
Residue:
806
  
Inhibitor
Name:
BDBM357246
Synonyms:
(5-amino-1-(2-cyclopropyl-1H-benzo[d]imidazol-5-yl)-1H-pyrazol-4-yl)(1H-indol-2-yl)methanone | US10214515, Example 1
Type:
Small organic molecule
Emp. Form.:
C22H18N6O
Mol. Mass.:
382.4179
SMILES:
Nc1c(cnn1-c1ccc2[nH]c(nc2c1)C1CC1)C(=O)c1cc2ccccc2[nH]1
: