Target
Fibroblast growth factor receptor 2
Ligand
BDBM357248
Substrate
Meas. Tech.
Determination of the Effects of the Compounds of the Present Invention on FGFR Kinase Activity
IC50
44.0±n/a nM
Citation
 Chen, LGuan, DBai, HYan, XMiao, SZhu, S Substituted pyrazoles as inhibitors of fibroblast growth factor receptor US Patent  US10214515 Publication Date 2/26/2019 
Target
Name:
Fibroblast growth factor receptor 2
Synonyms:
BEK FGFR-2 FGFR2 Fibroblast growth factor receptor 2 (FGFR2) KGFR Keratinocyte growth factor receptor VEGF-receptor 2 and Fibroblast growth factor receptor 2
Type:
Enzyme
Mol. Mass.:
92015.45
Organism:
Homo sapiens (Human)
Description:
P21802
Residue:
821
  
Inhibitor
Name:
BDBM357248
Synonyms:
Ethyl 5-(5-Amino-4-(1H-indole-2-carbonyl)-1H-pyrazol-1-yl)-1H-benzo[d]imidazole-2-carboxylate | US10214515, Example 9
Type:
Small organic molecule
Emp. Form.:
C22H18N6O3
Mol. Mass.:
414.4167
SMILES:
CCOC(=O)c1nc2cc(ccc2[nH]1)-n1ncc(C(=O)c2cc3ccccc3[nH]2)c1N
: