Target
Envelope glycoprotein gp160
Ligand
BDBM357265
Substrate
Meas. Tech.
Inhibition of HIV Replication
EC50
1.000±n/a nM
Citation
 Kadow, JFNaidu, BNWang, TYin, ZZhang, Z 5-(N-fused tricyclic aryl tetrahydroisoquinolin-6-yl) pyridin-3-yl acetic acid derivatives as inhibitors of human immunodeficiency virus replication US Patent  US10214516 Publication Date 2/26/2019 
Target
Name:
Envelope glycoprotein gp160
Synonyms:
Env polyprotein | NL4-3
Type:
Enzyme Catalytic Domain
Mol. Mass.:
97031.14
Organism:
Human immunodeficiency virus type 1 (isolate BRU/LAI group M subtypeB) (HIV-1)
Description:
Residue:
854
  
Inhibitor
Name:
BDBM357265
Synonyms:
US10214516, Compound 12
Type:
Small organic molecule
Emp. Form.:
C41H49N5O5
Mol. Mass.:
691.8583
SMILES:
CCOc1cccc2oc3c(ncnc3c12)N1CCc2cc(ccc2C1)-c1c(C)nc(C)c([C@H](OC(C)(C)C)C(O)=O)c1N1CCC(C)(C)CC1
: