Target
Dual specificity protein kinase TTK
Ligand
BDBM228260
Substrate
Meas. Tech.
Mps-1 Kinase Assay
pH
7.7±n/a
IC50
6.02±n/a nM
Comments
extracted
Citation
 Schulze, VKosemund, DSchirok, HBader, BLienau, PWengner, AMBriem, HHolton, SSiemeister, GPrechtl, SKoppitz, MStöckigt, DPrien, O Substituted triazolopyridines US Patent  US9555022 Publication Date 1/31/2017 
Target
Name:
Dual specificity protein kinase TTK
Synonyms:
Dual specificity protein kinase (TTK) MPS1 Monopolar Spindle 1 (MPS1) Monopolar Spindle 1 Kinase (MPS1) TTK | TTK_HUMAN
Type:
Protein
Mol. Mass.:
97086.79
Organism:
Homo sapiens (Human)
Description:
P33981
Residue:
857
  
Inhibitor
Name:
BDBM228260
Synonyms:
US9555022, Example 01.03
Type:
Small organic molecule
Emp. Form.:
C29H33N7O2
Mol. Mass.:
511.618
SMILES:
COc1cc(ccc1Nc1nc2ccc(cn2n1)-c1ccc(NC(=O)CC2CC2)cc1)N1CCN(C)CC1
: