Target
Dual specificity protein kinase TTK
Ligand
BDBM228290
Substrate
Meas. Tech.
Mps-1 Kinase Assay
pH
7.7±n/a
IC50
<1.000±n/a nM
Comments
extracted
Citation
 Schulze, VKosemund, DSchirok, HBader, BLienau, PWengner, AMBriem, HHolton, SSiemeister, GPrechtl, SKoppitz, MStöckigt, DPrien, O Substituted triazolopyridines US Patent  US9555022 Publication Date 1/31/2017 
Target
Name:
Dual specificity protein kinase TTK
Synonyms:
Dual specificity protein kinase (TTK) MPS1 Monopolar Spindle 1 (MPS1) Monopolar Spindle 1 Kinase (MPS1) TTK | TTK_HUMAN
Type:
Protein
Mol. Mass.:
97086.79
Organism:
Homo sapiens (Human)
Description:
P33981
Residue:
857
  
Inhibitor
Name:
BDBM228290
Synonyms:
US9555022, Example 02.26
Type:
Small organic molecule
Emp. Form.:
C34H28F4N6O4
Mol. Mass.:
660.6175
SMILES:
Fc1ccc(CC(=O)Nc2ccc(cc2)-c2ccc3nc(Nc4ccc(cc4OCC(F)(F)F)C(=O)N4CC5(COC5)C4)nn3c2)cc1
: