Target
Dual specificity protein kinase TTK
Ligand
BDBM228336
Substrate
Meas. Tech.
Mps-1 Kinase Assay
pH
7.7±n/a
IC50
<1.000±n/a nM
Comments
extracted
Citation
 Schulze, VKosemund, DSchirok, HBader, BLienau, PWengner, AMBriem, HHolton, SSiemeister, GPrechtl, SKoppitz, MStöckigt, DPrien, O Substituted triazolopyridines US Patent  US9555022 Publication Date 1/31/2017 
Target
Name:
Dual specificity protein kinase TTK
Synonyms:
Dual specificity protein kinase (TTK) MPS1 Monopolar Spindle 1 (MPS1) Monopolar Spindle 1 Kinase (MPS1) TTK | TTK_HUMAN
Type:
Protein
Mol. Mass.:
97086.79
Organism:
Homo sapiens (Human)
Description:
P33981
Residue:
857
  
Inhibitor
Name:
BDBM228336
Synonyms:
US9555022, Example 04.08
Type:
Small organic molecule
Emp. Form.:
C31H27FN6O4
Mol. Mass.:
566.5823
SMILES:
COc1cc(ccc1Nc1nc2ccc(cn2n1)-c1ccc(cc1)C(=O)NCc1ccc(F)cc1)C(=O)N1CC(O)C1
: