Target
Dual specificity protein kinase TTK
Ligand
BDBM228356
Substrate
Meas. Tech.
Mps-1 Kinase Assay
pH
7.7±n/a
IC50
<1.000±n/a nM
Comments
extracted
Citation
 Schulze, VKosemund, DSchirok, HBader, BLienau, PWengner, AMBriem, HHolton, SSiemeister, GPrechtl, SKoppitz, MStöckigt, DPrien, O Substituted triazolopyridines US Patent  US9555022 Publication Date 1/31/2017 
Target
Name:
Dual specificity protein kinase TTK
Synonyms:
Dual specificity protein kinase (TTK) MPS1 Monopolar Spindle 1 (MPS1) Monopolar Spindle 1 Kinase (MPS1) TTK | TTK_HUMAN
Type:
Protein
Mol. Mass.:
97086.79
Organism:
Homo sapiens (Human)
Description:
P33981
Residue:
857
  
Inhibitor
Name:
BDBM228356
Synonyms:
US9555022, Example 04.23
Type:
Small organic molecule
Emp. Form.:
C32H26F4N6O3
Mol. Mass.:
618.5809
SMILES:
Fc1ccc(CNC(=O)c2ccc(cc2)-c2ccc3nc(Nc4ccc(cc4C(F)(F)F)C(=O)N4CCOCC4)nn3c2)cc1
: