Target
Integrin alpha-4/beta-1 [T112H]
Ligand
BDBM17904
Substrate
Eu-Labeled Human VCAM-1/Fc Chimera
Meas. Tech.
VLA-4/VCAM-1 binding assay
pH
7.5±n/a
Temperature
295.15±n/a K
IC50
769±n/a nM
Citation
 Chiba, JIimura, SYoneda, YWatanabe, TMuro, FTsubokawa, MIigou, YSatoh, ATakayama, GYokoyama, MTakashi, TNakayama, AMachinaga, N Synthesis and biological evaluation of benzoic acid derivatives as potent, orally active VLA-4 antagonists. Bioorg Med Chem 15:1679-93 (2007)  
Target
Name:
Integrin alpha-4/beta-1 [T112H]
Synonyms:
CD49d/CD29 Very Late Antigen-4
Type:
Protein Complex
Mol. Mass.:
Description:
The assay uses transfected Ramos cells expressing alpha4beta1 integrin.
Components:
This complex has 2 components.
Component 1
Name:
Integrin alpha-4
Synonyms:
CD49 antigen-like family member D CD49d antigen ITA4_HUMAN Integrin alpha-4 Integrin alpha-IV VLA-4 integrin alpha 4 precursor | integrin alpha-4 precursor
Type:
Membrane Protein
Mol. Mass.:
114897.35
Organism:
Homo sapiens (Human)
Description:
P13612
Residue:
1032
  
Component 2
Name:
Integrin beta-1 [T112H]
Synonyms:
CD29 antigen Fibronectin receptor subunit beta ITGB1 Integrin beta1 MSK12
Type:
Membrane Protein
Mol. Mass.:
88450.95
Organism:
Homo sapiens (Human)
Description:
P05556[T112H]
Residue:
798
  
Inhibitor
Name:
BDBM17904
Synonyms:
4-{[(2S,4S)-4-fluoro-1-{2-[3-methoxy-4-({[2-(propan-2-yl)phenyl]carbamoyl}amino)phenyl]acetyl}pyrrolidin-2-yl]methoxy}benzoic acid | benzoic acid derivative, 12e
Type:
Small organic molecule
Emp. Form.:
C31H34FN3O6
Mol. Mass.:
563.6166
SMILES:
COc1cc(CC(=O)N2C[C@@H](F)C[C@H]2COc2ccc(cc2)C(O)=O)ccc1NC(=O)Nc1ccccc1C(C)C
:
Substrate
Name:
Eu-Labeled Human VCAM-1/Fc Chimera
Synonyms:
Recombinant Human VCAM-1/CD106/Fc Chimera
Type:
Other Protein Type
Mol. Mass.:
358.43
Organism:
Description:
A DNA sequence encoding the signal peptide from human CD33 joined with amino acid residues 25-698 of the extracellular domain of human vascular cell adhesion molecule 1 was fused to the 6X histidine tagged Fc of human IgG1 via a polypeptide linker. The chimeric protein was expressed in a mouse myeloma cell line, NS0.
Residue:
3
NA