Target
Renin
Ligand
BDBM17960
Substrate
Green Flourescent Protein (tGFP)
Meas. Tech.
In Vitro Renin IC50 Determinations (Tandem GFP FRET Assay)
pH
7.4±n/a
Temperature
295.15±n/a K
IC50
>10000±n/a nM
Citation
 Cody, WLHolsworth, DDPowell, NAJalaie, MZhang, EWang, WSamas, BBryant, JOstroski, RRyan, MJEdmunds, JJ The discovery and preparation of disubstituted novel amino-aryl-piperidine-based renin inhibitors. Bioorg Med Chem 13:59-68 (2005)  
Target
Name:
Renin
Synonyms:
Angiotensinogenase RENI_HUMAN
Type:
Enzyme
Mol. Mass.:
45058.99
Organism:
Homo sapiens (Human)
Description:
Residue:
406
  
Inhibitor
Name:
BDBM17960
Synonyms:
(3S,4R)-4-(4-{3-[(2-methoxyphenyl)methoxy]propoxy}phenyl)-N-[(4-phenylphenyl)methyl]piperidin-3-amine mixture of cis isomers
Type:
Small organic molecule
Emp. Form.:
C35H40N2O3
Mol. Mass.:
536.7037
SMILES:
COc1ccccc1COCCCOc1ccc(cc1)[C@H]1CCNC[C@H]1NCc1ccc(cc1)-c1ccccc1
:
Substrate
Name:
Green Flourescent Protein (tGFP)
Synonyms:
Type:
Other Protein Type
Mol. Mass.:
358.43
Organism:
Description:
The tGFP substrate contained a nine amino acid (Ile-His-Pro-Phe-His-Leu-Val-Ile-His) recognition sequence for human renin flanked by two GPF proteins (W1B and Topaz).
Residue:
3
NA