Target
Renin
Ligand
BDBM17989
Substrate
Green Flourescent Protein (tGFP)
Meas. Tech.
In Vitro Renin IC50 Determinations (Tandem GFP FRET Assay)
pH
7.4±n/a
Temperature
295.15±n/a K
IC50
1±n/a nM
Citation
 Powell, NACiske, FLCai, CHolsworth, DDMennen, KVan Huis, CAJalaie, MDay, JMastronardi, MMcConnell, PMochalkin, IZhang, ERyan, MJBryant, JCollard, WFerreira, SGu, CCollins, REdmunds, JJ Rational design of 6-(2,4-diaminopyrimidinyl)-1,4-benzoxazin-3-ones as small molecule renin inhibitors. Bioorg Med Chem 15:5912-49 (2007)  
Target
Name:
Renin
Synonyms:
Angiotensinogenase RENI_HUMAN
Type:
Enzyme
Mol. Mass.:
45058.99
Organism:
Homo sapiens (Human)
Description:
Residue:
406
  
Inhibitor
Name:
BDBM17989
Synonyms:
1,4-benzoxazin-3-one, 26 | N-{2-[6-(2,4-diamino-6-ethylpyrimidin-5-yl)-2-(3,5-difluorophenyl)-2-methyl-3-oxo-3,4-dihydro-2H-1,4-benzoxazin-4-yl]ethyl}acetamide
Type:
Small organic molecule
Emp. Form.:
C25H26F2N6O3
Mol. Mass.:
496.5091
SMILES:
CCc1nc(N)nc(N)c1-c1ccc2OC(C)(C(=O)N(CCNC(C)=O)c2c1)c1cc(F)cc(F)c1
:
Substrate
Name:
Green Flourescent Protein (tGFP)
Synonyms:
Type:
Other Protein Type
Mol. Mass.:
358.43
Organism:
Description:
The tGFP substrate contained a nine amino acid (Ile-His-Pro-Phe-His-Leu-Val-Ile-His) recognition sequence for human renin flanked by two GPF proteins (W1B and Topaz).
Residue:
3
NA