Target
Carbonic anhydrase 9
Ligand
BDBM50387129
Substrate
Ki
9.0±n/a nM
Citation
 Sethi, KKVerma, SM A systematic quantitative approach to rational drug design and discovery of novel human carbonic anhydrase IX inhibitors. J Enzyme Inhib Med Chem 29:571-81 (2014)  
Target
Name:
Carbonic anhydrase 9
Synonyms:
CA-IX CAH9_HUMAN Carbonic anhydrase 9 (CA IX) Carbonic anhydrase 9 precursor Carbonic anhydrase IX (CAIX) Carbonic anhydrases; II & IX MN RCC-associated antigen G250
Type:
Enzyme
Mol. Mass.:
49669.03
Organism:
Homo sapiens (Human)
Description:
Catalytic domain of human cloned isozyme was used in the assay
Residue:
459
  
Inhibitor
Name:
BDBM50387129
Synonyms:
4-ureidophenyl sulfamate ring derivative 3n | CHEMBL2047809
Type:
Small organic molecule
Emp. Form.:
C15H18N4O4S
Mol. Mass.:
350.393
SMILES:
CN(C)c1ccc(NC(=O)Nc2ccc(OS(N)(=O)=O)cc2)cc1
: