Target
Carbonic anhydrase 9
Ligand
BDBM50387134
Substrate
Ki
9.0±n/a nM
Citation
 Sethi, KKVerma, SM A systematic quantitative approach to rational drug design and discovery of novel human carbonic anhydrase IX inhibitors. J Enzyme Inhib Med Chem 29:571-81 (2014)  
Target
Name:
Carbonic anhydrase 9
Synonyms:
CA-IX CAH9_HUMAN Carbonic anhydrase 9 (CA IX) Carbonic anhydrase 9 precursor Carbonic anhydrase IX (CAIX) Carbonic anhydrases; II & IX MN RCC-associated antigen G250
Type:
Enzyme
Mol. Mass.:
49669.03
Organism:
Homo sapiens (Human)
Description:
Catalytic domain of human cloned isozyme was used in the assay
Residue:
459
  
Inhibitor
Name:
BDBM50387134
Synonyms:
4-ureidophenyl sulfamate ring derivative 3s | CHEMBL2047814
Type:
Small organic molecule
Emp. Form.:
C13H10BrF2N3O4S
Mol. Mass.:
422.202
SMILES:
NS(=O)(=O)Oc1ccc(NC(=O)Nc2c(F)cc(F)cc2Br)cc1
: