Target
Carbonic anhydrase 9
Ligand
BDBM50387140
Substrate
Ki
10.0±n/a nM
Citation
 Sethi, KKVerma, SM A systematic quantitative approach to rational drug design and discovery of novel human carbonic anhydrase IX inhibitors. J Enzyme Inhib Med Chem 29:571-81 (2014)  
Target
Name:
Carbonic anhydrase 9
Synonyms:
CA-IX CAH9_HUMAN Carbonic anhydrase 9 (CA IX) Carbonic anhydrase 9 precursor Carbonic anhydrase IX (CAIX) Carbonic anhydrases; II & IX MN RCC-associated antigen G250
Type:
Enzyme
Mol. Mass.:
49669.03
Organism:
Homo sapiens (Human)
Description:
Catalytic domain of human cloned isozyme was used in the assay
Residue:
459
  
Inhibitor
Name:
BDBM50387140
Synonyms:
4-ureidophenyl sulfamate ring derivative 3z | CHEMBL2047820
Type:
Small organic molecule
Emp. Form.:
C15H17N3O5S
Mol. Mass.:
351.378
SMILES:
COc1ccc(NC(=O)Nc2ccc(OS(N)(=O)=O)cc2)c(C)c1
: