Target
Lysine-specific histone demethylase 1A
Ligand
BDBM151623
Substrate
Meas. Tech.
LSD1 Histone Demethylase Assay
IC50
28±n/a nM
Citation
 Vankayalapati, HSorna, VWarner, SLStephens, BBearss, DJSharma, S Substituted (E)-N′-(1-phenylethylidene)benzohydrazide analogs as histone demethylase inhibitors US Patent  US9555024 Publication Date 1/31/2017 
Target
Name:
Lysine-specific histone demethylase 1A
Synonyms:
AOF2 Flavin-containing amine oxidase domain-containing protein 2 KDM1A KIAA0601 Lysine-specific demethylase 1 (LSD1) Lysine-specific histone demethylase 1 (LSD1)
Type:
Enzyme
Mol. Mass.:
92901.01
Organism:
Homo sapiens (Human)
Description:
O60341
Residue:
852
  
Inhibitor
Name:
BDBM151623
Synonyms:
US8987335, 24
Type:
Small organic molecule
Emp. Form.:
C15H14ClN3O4S
Mol. Mass.:
367.807
SMILES:
C\C(=N/NC(=O)c1cncc(c1)S(C)(=O)=O)c1cc(Cl)ccc1O
: